catkin_make编译ros包的时候出现Invoking “make -j4 -l4” failed
w945150145
w945150145 3737 0
2016-10-07 21:09
ROS新手,用catkin_make编译包的时候出现了下面的问题,求大神指教:

.....
_kcf.cpp:44:28: fatal error: KCF/BoundingBox.h: 没有那个文件或目录
compilation terminated.
kcf_tld_tracking_ros-master/KCF_TLD/KCF/CMakeFiles/KCFcpp.dir/build.make:62: recipe for target 'kcf_tld_tracking_ros-master/KCF_TLD/KCF/CMakeFiles/KCFcpp.dir/src/main/main_kcf.cpp.o' failed
make[2]: *** [kcf_tld_tracking_ros-master/KCF_TLD/KCF/CMakeFiles/KCFcpp.dir/src/main/main_kcf.cpp.o] Error 1
CMakeFiles/Makefile2:1128:recipe for target 'kcf_tld_tracking_ros-master/KCF_TLD/KCF/CMakeFiles/KCFcpp.dir/all' failed
make[1]: *** [kcf_tld_tracking_ros-master/KCF_TLD/KCF/CMakeFiles/KCFcpp.dir/all] Error 2
........
Invoking “make -j4 -l4” failed




我编译的是KCF、Opentld和KCF-TLD以及freenect等相关包。
分享:
游客
要评论请先登录 或者 注册
 返回顶部